Target
Myeloperoxidase
Ligand
BDBM513879
Substrate
Meas. Tech.
MPO Chlorination Assay (APF Assay)
IC50
50±n/a nM
Citation
 Smallheer, JMHu, CHValente, MNShaw, SAVokits, BPHalpern, OS Triazolopyridine inhibitors of myeloperoxidase US Patent  US11059818 Publication Date 7/13/2021 
Target
Name:
Myeloperoxidase
Synonyms:
84 kDa myeloperoxidase MPO Myeloperoxidase Myeloperoxidase heavy chain PERM_HUMAN
Type:
Enzyme
Mol. Mass.:
83888.32
Organism:
Homo sapiens (Human)
Description:
P05164
Residue:
745
  
Inhibitor
Name:
BDBM513879
Synonyms:
US11059818, Example 5
Type:
Small organic molecule
Emp. Form.:
C34H34N8
Mol. Mass.:
554.6874
SMILES:
Nc1cc(C(CCC(c2ccccc2)c2ccccc2)c2cnn(Cc3ccc4CNCCc4c3)c2)c2nn[nH]c2n1
: