Target
Myeloperoxidase
Ligand
BDBM513912
Substrate
Meas. Tech.
MPO Chlorination Assay (APF Assay)
IC50
50±n/a nM
Citation
 Smallheer, JMHu, CHValente, MNShaw, SAVokits, BPHalpern, OS Triazolopyridine inhibitors of myeloperoxidase US Patent  US11059818 Publication Date 7/13/2021 
Target
Name:
Myeloperoxidase
Synonyms:
84 kDa myeloperoxidase MPO Myeloperoxidase Myeloperoxidase heavy chain PERM_HUMAN
Type:
Enzyme
Mol. Mass.:
83888.32
Organism:
Homo sapiens (Human)
Description:
P05164
Residue:
745
  
Inhibitor
Name:
BDBM513912
Synonyms:
US11059818, Example 37
Type:
Small organic molecule
Emp. Form.:
C32H36N8O
Mol. Mass.:
548.6812
SMILES:
Nc1cc(C(CCNC23CCC(CC2)(CC3)c2ccccc2)c2ccn(Cc3cccc(O)c3)n2)c2nn[nH]c2n1
: