Target
Myeloperoxidase
Ligand
BDBM513913
Substrate
Meas. Tech.
MPO Chlorination Assay (APF Assay)
IC50
50±n/a nM
Citation
 Smallheer, JMHu, CHValente, MNShaw, SAVokits, BPHalpern, OS Triazolopyridine inhibitors of myeloperoxidase US Patent  US11059818 Publication Date 7/13/2021 
Target
Name:
Myeloperoxidase
Synonyms:
84 kDa myeloperoxidase MPO Myeloperoxidase Myeloperoxidase heavy chain PERM_HUMAN
Type:
Enzyme
Mol. Mass.:
83888.32
Organism:
Homo sapiens (Human)
Description:
P05164
Residue:
745
  
Inhibitor
Name:
BDBM513913
Synonyms:
US11059818, Example 38
Type:
Small organic molecule
Emp. Form.:
C33H38N8O2
Mol. Mass.:
578.7072
SMILES:
Nc1cc(C(CCNC23CCC(CC2)([C@H](O)C3)c2ccccc2)c2ccn(CCc3cccc(O)c3)n2)c2nn[nH]c2n1
: