Target
High affinity nerve growth factor receptor
Ligand
BDBM410187
Substrate
Meas. Tech.
NTRK1 Wild Type Assay at 1 mM ATP
IC50
<100±n/a nM
Citation
 Wenglowsky, SMMiduturu, CVBifulco, NKim, JL Compounds and compositions useful for treating disorders related to NTRK US Patent  US11059827 Publication Date 7/13/2021 
Target
Name:
High affinity nerve growth factor receptor
Synonyms:
2.7.10.1 NTRK1 NTRK1_HUMAN Neurotrophic tyrosine kinase receptor type 1 Synonyms=MTC TRK1-transforming tyrosine kinase protein TRKA GN Trk-A Tropomyosin-related kinase A Tyrosine kinase receptor Tyrosine kinase receptor A Tyrosine kinase receptor A (Trk-A) gp140trk | p140-TrkA
Type:
Mol. Mass.:
87498.18
Organism:
Homo sapiens (Human)
Description:
P04629
Residue:
796
  
Inhibitor
Name:
BDBM410187
Synonyms:
6-fluoro-5-((2R,4S)-4-fluoro-2-(5-fluoropyridin-3-yl)pyrrolidin-1-yl)pyrazolo[1,5-a]pyrimidine-3-carbonitrile US11059827, Compound 4
Type:
Small organic molecule
Emp. Form.:
C16H11F3N6
Mol. Mass.:
344.2939
SMILES:
F[C@H]1C[C@@H](N(C1)c1nc2c(cnn2cc1F)C#N)c1cncc(F)c1
: