Target
High affinity nerve growth factor receptor
Ligand
BDBM410199
Substrate
Meas. Tech.
NTRK1 Wild Type Assay at 1 mM ATP
IC50
<100±n/a nM
Citation
 Wenglowsky, SMMiduturu, CVBifulco, NKim, JL Compounds and compositions useful for treating disorders related to NTRK US Patent  US11059827 Publication Date 7/13/2021 
Target
Name:
High affinity nerve growth factor receptor
Synonyms:
2.7.10.1 NTRK1 NTRK1_HUMAN Neurotrophic tyrosine kinase receptor type 1 Synonyms=MTC TRK1-transforming tyrosine kinase protein TRKA GN Trk-A Tropomyosin-related kinase A Tyrosine kinase receptor Tyrosine kinase receptor A Tyrosine kinase receptor A (Trk-A) gp140trk | p140-TrkA
Type:
Mol. Mass.:
87498.18
Organism:
Homo sapiens (Human)
Description:
P04629
Residue:
796
  
Inhibitor
Name:
BDBM410199
Synonyms:
US10370379, Compound 16 | US11059827, Compound 16
Type:
Small organic molecule
Emp. Form.:
C17H14F2N6O2S
Mol. Mass.:
404.394
SMILES:
NS(=O)(=O)c1cc(F)cc(c1)[C@H]1C[C@H](F)CN1c1ccn2ncc(C#N)c2n1
: