Target
Orexin/Hypocretin receptor type 1
Ligand
BDBM118528
Substrate
Meas. Tech.
Human Orexin 1 Receptor Radioligand Binding Studies
Ki
8999±n/a nM
Citation
 Chai, WLetavic, MALy, KSPippel, DJRudolph, DASappey, KCSavall, BMShah, CRShireman, BTJohnson, ASStocking, EMSwanson, DM Disubstituted octahydropyrrolo[3,4-C]pyrroles as orexin receptor modulators US Patent  US11059828 Publication Date 7/13/2021 
Target
Name:
Orexin/Hypocretin receptor type 1
Synonyms:
HCRTR1 OX1R_HUMAN Orexin receptor type 1 (OR 1) Orexin receptor type 1 (OX1) Orexin receptor type 1 (OxR1) | Ox1r
Type:
Protein
Mol. Mass.:
47554.50
Organism:
Homo sapiens (Human)
Description:
O43613
Residue:
425
  
Inhibitor
Name:
BDBM118528
Synonyms:
US11059828, Example 181 US8653263, 181 USRE48841, Example 181
Type:
Small organic molecule
Emp. Form.:
C26H23N5O
Mol. Mass.:
421.4937
SMILES:
O=C(N1CC2CN(CC2C1)c1cnc2ccccc2n1)c1ccccc1-c1cccnc1
: