Target
Ubiquitin carboxyl-terminal hydrolase 30
Ligand
BDBM514230
Substrate
Meas. Tech.
USP30 Biochemical Fluorescence Intensity IC50 Assay
IC50
550±n/a nM
Citation
 Jones, AKemp, MStockley, MGibson, KWhitlock, G 1-cyano-pyrrolidine compounds as USP30 inhibitors US Patent  US11053198 Publication Date 7/6/2021 
Target
Name:
Ubiquitin carboxyl-terminal hydrolase 30
Synonyms:
Deubiquitinating enzyme 30 USP30 Ubiquitin carboxyl-terminal hydrolase 30 (USP30) Ubiquitin-specific-processing protease 30
Type:
Protein
Mol. Mass.:
58522.90
Organism:
Homo sapiens (Human)
Description:
Q70CQ3
Residue:
517
  
Inhibitor
Name:
BDBM514230
Synonyms:
N-(1-cyanopyrrolidin-3-yl)-6-(4- (2,4-difluorophenyl)piperazin-1- yl)nicotinamide US11390584, Example 19
Type:
Small organic molecule
Emp. Form.:
C21H22F2N6O
Mol. Mass.:
412.4358
SMILES:
Fc1ccc(N2CCN(CC2)c2ccc(cn2)C(=O)N[C@@H]2CCN(C2)C#N)c(F)c1
: