Target
Ubiquitin carboxyl-terminal hydrolase 30
Ligand
BDBM404523
Substrate
Meas. Tech.
USP30 Biochemical Fluorescence Intensity IC50 Assay
IC50
<100±n/a nM
Citation
 Jones, AKemp, MStockley, MGibson, KWhitlock, G 1-cyano-pyrrolidine compounds as USP30 inhibitors US Patent  US11053198 Publication Date 7/6/2021 
Target
Name:
Ubiquitin carboxyl-terminal hydrolase 30
Synonyms:
Deubiquitinating enzyme 30 USP30 Ubiquitin carboxyl-terminal hydrolase 30 (USP30) Ubiquitin-specific-processing protease 30
Type:
Protein
Mol. Mass.:
58522.90
Organism:
Homo sapiens (Human)
Description:
Q70CQ3
Residue:
517
  
Inhibitor
Name:
BDBM404523
Synonyms:
3-chloro-N-((trans)-1-cyano-4-methylpyrrolidin-3-yl)-4-morpholinobenzamide US10689345, Example 175 US11066365, Example 175 | US11390584, Example 175
Type:
Small organic molecule
Emp. Form.:
C17H21ClN4O2
Mol. Mass.:
348.827
SMILES:
C[C@H]1CN(C[C@@H]1NC(=O)c1ccc(N2CCOCC2)c(Cl)c1)C#N
: