Target
Ubiquitin carboxyl-terminal hydrolase 30
Ligand
BDBM505509
Substrate
Meas. Tech.
USP30 Biochemical Fluorescence Intensity IC50 Assay
IC50
<100±n/a nM
Citation
 Jones, AKemp, MStockley, MGibson, KWhitlock, G 1-cyano-pyrrolidine compounds as USP30 inhibitors US Patent  US11053198 Publication Date 7/6/2021 
Target
Name:
Ubiquitin carboxyl-terminal hydrolase 30
Synonyms:
Deubiquitinating enzyme 30 USP30 Ubiquitin carboxyl-terminal hydrolase 30 (USP30) Ubiquitin-specific-processing protease 30
Type:
Protein
Mol. Mass.:
58522.90
Organism:
Homo sapiens (Human)
Description:
Q70CQ3
Residue:
517
  
Inhibitor
Name:
BDBM505509
Synonyms:
(R)?N-(1-cyanopyrrolidin-3-yl)-4-(2,6-dimethylpyrimidin-4-yl)-2-fluorobenzamide US11066365, Example 181
Type:
Small organic molecule
Emp. Form.:
C22H32BFN2O5
Mol. Mass.:
434.309
SMILES:
CC(C)(C)OC(=O)N1CC[C@H](C1)NC(=O)c1ccc(cc1F)B1OC(C)(C)C(C)(C)O1
: