Target
Potassium channel subfamily K member 9
Ligand
BDBM515513
Substrate
Meas. Tech.
Inhibition of Recombinant TASK-1 and TASK-3 In Vitro
IC50
1.80±n/a nM
Citation
 Delbeck, MHahn, MMüller, TLustig, KCollins, KLindner, NNicolai, JBeck-Broichsitter, MAlbus, UGehring, DRosenstein, B Diazabicyclic substituted imidazopyrimidines and their use for the treatment of breathing disorders US Patent  US11098063 Publication Date 8/24/2021 
Target
Name:
Potassium channel subfamily K member 9
Synonyms:
Acid-sensitive potassium channel protein TASK-3 KCNK9_HUMAN TWIK-related acid-sensitive K(+) channel 3 Two pore potassium channel KT3.2
Type:
PROTEIN
Mol. Mass.:
42276.04
Organism:
Homo sapiens (Human)
Description:
ChEMBL_1457494
Residue:
374
  
Inhibitor
Name:
BDBM515513
Synonyms:
(3-Chloro-6-methoxypyridin-2-yl)(3-{[2-(4-isopropylphenyl)imidazo[1,2-a]pyrimidin-3-yl]methyl}-3,8-diazabicyclo[3.2.1]oct-8-yl)methanone | US11098063, Example 29
Type:
Small organic molecule
Emp. Form.:
C29H31ClN6O2
Mol. Mass.:
531.048
SMILES:
COc1ccc(Cl)c(n1)C(=O)N1C2CCC1CN(Cc1c(nc3ncccn13)-c1ccc(cc1)C(C)C)C2
: