Target
Potassium channel subfamily K member 9
Ligand
BDBM515556
Substrate
Meas. Tech.
Inhibition of Recombinant TASK-1 and TASK-3 In Vitro
IC50
13.0±n/a nM
Citation
 Delbeck, MHahn, MMüller, TLustig, KCollins, KLindner, NNicolai, JBeck-Broichsitter, MAlbus, UGehring, DRosenstein, B Diazabicyclic substituted imidazopyrimidines and their use for the treatment of breathing disorders US Patent  US11098063 Publication Date 8/24/2021 
Target
Name:
Potassium channel subfamily K member 9
Synonyms:
Acid-sensitive potassium channel protein TASK-3 KCNK9_HUMAN TWIK-related acid-sensitive K(+) channel 3 Two pore potassium channel KT3.2
Type:
PROTEIN
Mol. Mass.:
42276.04
Organism:
Homo sapiens (Human)
Description:
ChEMBL_1457494
Residue:
374
  
Inhibitor
Name:
BDBM515556
Synonyms:
US11098063, Example 54
Type:
Small organic molecule
Emp. Form.:
C26H27ClN6OS
Mol. Mass.:
507.05
SMILES:
CC(C)c1nc(cs1)C(=O)N1C2CCC1CN(Cc1c(nc3ncccn13)-c1ccc(Cl)cc1)C2
: