Target
Tyrosine-protein kinase Mer
Ligand
BDBM515806
Substrate
Meas. Tech.
Verification on Inhibitory Activities of TAM Receptor Inhibiting Compounds on Tyro 3, Axl, and Mer
IC50
0.900±n/a nM
Citation
 Cho, SYLee, CHMin, YKHwang, JY Pyrimidine derivative compound, optical isomer thereof, or pharmaceutically acceptable salt thereof, and composition for preventing or treating Tyro 3 related disease comprising same as active ingredient US Patent  US11053225 Publication Date 7/6/2021 
Target
Name:
Tyrosine-protein kinase Mer
Synonyms:
MER MERTK Proto-oncogene c-Mer Receptor tyrosine kinase MerTK | Tyrosine-protein kinase Mer
Type:
PROTEIN
Mol. Mass.:
110234.77
Organism:
Homo sapiens (Human)
Description:
ChEMBL_1498723
Residue:
999
  
Inhibitor
Name:
BDBM515806
Synonyms:
US11053225, Compound 115
Type:
Small organic molecule
Emp. Form.:
C23H24F5N7O2
Mol. Mass.:
525.4744
SMILES:
OCCn1cc(cn1)-c1cnc(Nc2cc(F)cc(F)c2)nc1NC1CC[C@@H](CC1)NC(=O)C(F)(F)F
: