Target
Tyrosine-protein kinase Mer
Ligand
BDBM515807
Substrate
Meas. Tech.
Verification on Inhibitory Activities of TAM Receptor Inhibiting Compounds on Tyro 3, Axl, and Mer
IC50
1.000±n/a nM
Citation
 Cho, SYLee, CHMin, YKHwang, JY Pyrimidine derivative compound, optical isomer thereof, or pharmaceutically acceptable salt thereof, and composition for preventing or treating Tyro 3 related disease comprising same as active ingredient US Patent  US11053225 Publication Date 7/6/2021 
Target
Name:
Tyrosine-protein kinase Mer
Synonyms:
MER MERTK Proto-oncogene c-Mer Receptor tyrosine kinase MerTK | Tyrosine-protein kinase Mer
Type:
PROTEIN
Mol. Mass.:
110234.77
Organism:
Homo sapiens (Human)
Description:
ChEMBL_1498723
Residue:
999
  
Inhibitor
Name:
BDBM515807
Synonyms:
US11053225, Compound 117
Type:
Small organic molecule
Emp. Form.:
C21H25F2N7O
Mol. Mass.:
429.4663
SMILES:
N[C@H]1CCC(CC1)Nc1nc(Nc2cc(F)cc(F)c2)ncc1-c1cnn(CCO)c1
: