Target
Toll-like receptor 8
Ligand
BDBM427663
Substrate
Meas. Tech.
TLR7/8/9 Inhibition Reporter Assays
IC50
0.280±n/a nM
Citation
 Dyckman, AJDodd, DSMussari, CPSherwood, TCWhiteley, BKGilmore, JLKumar, SRPasunoori, LSrinivas, PVDuraisamy, SKHegde, SAnumula, RK 4-azaindole compounds US Patent  US11053244 Publication Date 7/6/2021 
Target
Name:
Toll-like receptor 8
Synonyms:
CD_antigen: CD288 TLR8_HUMAN | TRL8
Type:
Enzyme
Mol. Mass.:
119828.77
Organism:
Homo sapiens (Human)
Description:
Q9NR97
Residue:
1041
  
Inhibitor
Name:
BDBM427663
Synonyms:
6-(3-isopropyl-5-(4-methylpiperazin-1-yl)-1H-pyrrolo[3,2-b]pyridin-2-yl)-7,8-dimethyl-[1,2,4]triazolo[1,5-a]pyridine US10730877, Example 96 | US11053244, Example 96
Type:
Small organic molecule
Emp. Form.:
C23H29N7
Mol. Mass.:
403.5233
SMILES:
CC(C)c1c([nH]c2ccc(nc12)N1CCN(C)CC1)-c1cn2ncnc2c(C)c1C
: