Target
Toll-like receptor 7
Ligand
BDBM427755
Substrate
Meas. Tech.
TLR7/8/9 Inhibition Reporter Assays
IC50
0.290±n/a nM
Citation
 Dyckman, AJDodd, DSMussari, CPSherwood, TCWhiteley, BKGilmore, JLKumar, SRPasunoori, LSrinivas, PVDuraisamy, SKHegde, SAnumula, RK 4-azaindole compounds US Patent  US11053244 Publication Date 7/6/2021 
Target
Name:
Toll-like receptor 7
Synonyms:
ORF Names:UNQ248/PRO285 TLR7_HUMAN | Toll-like receptor 7 (TLR7)
Type:
Enzyme
Mol. Mass.:
120945.35
Organism:
Homo sapiens (Human)
Description:
Q9NYK1
Residue:
1049
  
Inhibitor
Name:
BDBM427755
Synonyms:
US10544143, Example 188 US10730877, Example 189 | US11053244, Example 189
Type:
Small organic molecule
Emp. Form.:
C24H30N6O
Mol. Mass.:
418.5346
SMILES:
CNC1CCC(CC1)c1ccc2[nH]c(c(C(C)C)c2n1)-c1cc(OC)c2ncnn2c1
: