Target
Toll-like receptor 7
Ligand
BDBM427741
Substrate
Meas. Tech.
TLR7/8/9 Inhibition Reporter Assays
IC50
0.160±n/a nM
Citation
 Dyckman, AJDodd, DSMussari, CPSherwood, TCWhiteley, BKGilmore, JLKumar, SRPasunoori, LSrinivas, PVDuraisamy, SKHegde, SAnumula, RK 4-azaindole compounds US Patent  US11053244 Publication Date 7/6/2021 
Target
Name:
Toll-like receptor 7
Synonyms:
ORF Names:UNQ248/PRO285 TLR7_HUMAN | Toll-like receptor 7 (TLR7)
Type:
Enzyme
Mol. Mass.:
120945.35
Organism:
Homo sapiens (Human)
Description:
Q9NYK1
Residue:
1049
  
Inhibitor
Name:
BDBM427741
Synonyms:
US10544143, Example 174 US11053244, Example 199
Type:
Small organic molecule
Emp. Form.:
C27H34N6O
Mol. Mass.:
458.5985
SMILES:
COc1cc(cn2ncnc12)-c1[nH]c2ccc(nc2c1C(C)C)C1CCC(CC1)N1CCCC1
: