Target
Ectonucleotide pyrophosphatase/phosphodiesterase family member 2
Ligand
BDBM516880
Substrate
Meas. Tech.
Biochemical ATX Assay (Assay A)
IC50
6.00±n/a nM
Citation
 Roth, GJBretschneider, TKuttruff, CA Pyridazines US Patent  US11104665 Publication Date 8/31/2021 
Target
Name:
Ectonucleotide pyrophosphatase/phosphodiesterase family member 2
Synonyms:
ATX Autotaxin (ATX) ENPP2 Ectonucleotide Pyrophosphatase/Phosphodiesterase 2 (ENPP2) Extracellular lysophospholipase D PDNP2
Type:
Enzyme
Mol. Mass.:
99007.13
Organism:
Homo sapiens (Human)
Description:
Q13822
Residue:
863
  
Inhibitor
Name:
BDBM516880
Synonyms:
US11104665, Example 1.1
Type:
Small organic molecule
Emp. Form.:
C24H25Cl2N5O2
Mol. Mass.:
486.394
SMILES:
CC(=O)N1CCN(CC1)c1ccc(CNc2ccc(OCc3cc(Cl)cc(Cl)c3)nn2)cc1
: