Target
Ectonucleotide pyrophosphatase/phosphodiesterase family member 2
Ligand
BDBM516885
Substrate
Meas. Tech.
Biochemical ATX Assay (Assay A)
IC50
5.00±n/a nM
Citation
 Roth, GJBretschneider, TKuttruff, CA Pyridazines US Patent  US11104665 Publication Date 8/31/2021 
Target
Name:
Ectonucleotide pyrophosphatase/phosphodiesterase family member 2
Synonyms:
ATX Autotaxin (ATX) ENPP2 Ectonucleotide Pyrophosphatase/Phosphodiesterase 2 (ENPP2) Extracellular lysophospholipase D PDNP2
Type:
Enzyme
Mol. Mass.:
99007.13
Organism:
Homo sapiens (Human)
Description:
Q13822
Residue:
863
  
Inhibitor
Name:
BDBM516885
Synonyms:
US11104665, Example 1.6
Type:
Small organic molecule
Emp. Form.:
C26H25F3N6O3
Mol. Mass.:
526.5103
SMILES:
CC(=O)N1CCN(CC1)c1ccc(CNc2ccc(OCc3cc(OC(F)(F)F)cc(c3)C#N)nn2)cc1
: