Target
Ectonucleotide pyrophosphatase/phosphodiesterase family member 2
Ligand
BDBM516887
Substrate
Meas. Tech.
Biochemical ATX Assay (Assay A)
IC50
3.00±n/a nM
Citation
 Roth, GJBretschneider, TKuttruff, CA Pyridazines US Patent  US11104665 Publication Date 8/31/2021 
Target
Name:
Ectonucleotide pyrophosphatase/phosphodiesterase family member 2
Synonyms:
ATX Autotaxin (ATX) ENPP2 Ectonucleotide Pyrophosphatase/Phosphodiesterase 2 (ENPP2) Extracellular lysophospholipase D PDNP2
Type:
Enzyme
Mol. Mass.:
99007.13
Organism:
Homo sapiens (Human)
Description:
Q13822
Residue:
863
  
Inhibitor
Name:
BDBM516887
Synonyms:
US11104665, Example 2.2
Type:
Small organic molecule
Emp. Form.:
C25H29N5O3
Mol. Mass.:
447.5295
SMILES:
COc1ccc(COc2ccc(NCc3ccc(cc3)C3CCN(CC3)C(C)=O)nn2)cn1
: