Target
Ectonucleotide pyrophosphatase/phosphodiesterase family member 2
Ligand
BDBM191570
Substrate
Meas. Tech.
Biochemical ATX Assay (Assay A)
IC50
2.00±n/a nM
Citation
 Roth, GJBretschneider, TKuttruff, CA Pyridazines US Patent  US11104665 Publication Date 8/31/2021 
Target
Name:
Ectonucleotide pyrophosphatase/phosphodiesterase family member 2
Synonyms:
ATX Autotaxin (ATX) ENPP2 Ectonucleotide Pyrophosphatase/Phosphodiesterase 2 (ENPP2) Extracellular lysophospholipase D PDNP2
Type:
Enzyme
Mol. Mass.:
99007.13
Organism:
Homo sapiens (Human)
Description:
Q13822
Residue:
863
  
Inhibitor
Name:
BDBM191570
Synonyms:
US10526329, Compound 12 US11104665, WO2014/139882 Example 12 WO2014139882, Compound 12
Type:
Small organic molecule
Emp. Form.:
C29H30F2N8O2S
Mol. Mass.:
592.663
SMILES:
CCc1nc2c(F)cc(cn2c1N(C)c1nc(c(s1)C#N)-c1ccc(F)cc1)N1CCN(CC(=O)N2CC(O)C2)CC1
: