Target
Ectonucleotide pyrophosphatase/phosphodiesterase family member 2
Ligand
BDBM516893
Substrate
Meas. Tech.
Biochemical ATX Assay (Assay A)
IC50
2.20±n/a nM
Citation
 Roth, GJBretschneider, TKuttruff, CA Pyridazines US Patent  US11104665 Publication Date 8/31/2021 
Target
Name:
Ectonucleotide pyrophosphatase/phosphodiesterase family member 2
Synonyms:
ATX Autotaxin (ATX) ENPP2 Ectonucleotide Pyrophosphatase/Phosphodiesterase 2 (ENPP2) Extracellular lysophospholipase D PDNP2
Type:
Enzyme
Mol. Mass.:
99007.13
Organism:
Homo sapiens (Human)
Description:
Q13822
Residue:
863
  
Inhibitor
Name:
BDBM516893
Synonyms:
US11104665, ACS Med. Chem. Lett. 2017, 8, 1252-1257 Example 19
Type:
Small organic molecule
Emp. Form.:
C23H19F6N5O3
Mol. Mass.:
527.4191
SMILES:
FC(F)(F)c1cc(COC(=O)N2C[C@H]3C(CNC(=O)c4ccc5n[nH]nc5c4)[C@H]3C2)cc(c1)C(F)(F)F
: