Target
Bifunctional epoxide hydrolase 2
Ligand
BDBM409028
Substrate
Meas. Tech.
Assays for Epoxide Hydrolase Activity
Ki
6.60±0.01 nM
Citation
 Hammock, BDMorisseau, CYang, JHashimoto, K Methods of treating mental disorders US Patent  US11123311 Publication Date 9/21/2021 
Target
Name:
Bifunctional epoxide hydrolase 2
Synonyms:
Cytosolic epoxide hydrolase 2 EPHX2 HYES_HUMAN Soluble epoxide hydrolase (sEH) | epoxide hydrolase 2, cytoplasmic
Type:
Enzyme
Mol. Mass.:
62613.07
Organism:
Homo sapiens (Human)
Description:
P34913
Residue:
555
  
Inhibitor
Name:
BDBM409028
Synonyms:
US10377744, Compound No. 48 US11723929, Compound 48
Type:
Small organic molecule
Emp. Form.:
C18H20F4N2O3
Mol. Mass.:
388.3566
SMILES:
Fc1cc(NC(=O)CC2CCN(CC2)C(=O)C2CC2)ccc1OC(F)(F)F
: