Target
Cytoplasmic tyrosine-protein kinase BMX
Ligand
BDBM515341
Substrate
Meas. Tech.
IMAP (Immobilized Metal Ion Affinity-Based Fluorescence Polarization) Assay
IC50
3.50±n/a nM
Citation
 Barf, Tde Zwart, EVerkaik, SHoogenboom, NDemont, D Imidazopyrazine inhibitors of Bruton's tyrosine kinase US Patent  US11110088 Publication Date 9/7/2021 
Target
Name:
Cytoplasmic tyrosine-protein kinase BMX
Synonyms:
BMX BMX_HUMAN Cytoplasmic tyrosine-protein kinase BMX (BMX) Epithelial and endothelial tyrosine kinase Tyrosine Kinase BMX | Tyrosine-protein kinase BMX/ETK
Type:
Tyrosine-protein kinase
Mol. Mass.:
78030.42
Organism:
Homo sapiens (Human)
Description:
P51813
Residue:
675
  
Inhibitor
Name:
BDBM515341
Synonyms:
US11110088, Compound Table 1.15
Type:
Small organic molecule
Emp. Form.:
C26H22F3N7O3
Mol. Mass.:
537.4932
SMILES:
COc1cc(ccc1C(=O)Nc1cc(ccn1)C(F)(F)F)-c1nc([C@H](C)NC(=O)C#CC)n2ccnc(N)c12
: