Target
Mitogen-activated protein kinase kinase kinase kinase 1
Ligand
BDBM519595
Substrate
Meas. Tech.
HPK1 Biochemical Enzyme Assay
Ki
0.090±n/a nM
Citation
 Gallego, RANair, SKKania, RSAhmad, OKJohnson, TWTuttle, JBJalaie, MMcTigue, MAZhou, DDel Bel, MLZhou, RHe, MSchmitt, AD Azalactam compounds as HPK1 inhibitors US Patent  US11142525 Publication Date 10/12/2021 
Target
Name:
Mitogen-activated protein kinase kinase kinase kinase 1
Synonyms:
HPK1 MAP4K1
Type:
PROTEIN
Mol. Mass.:
91316.07
Organism:
Homo sapiens (Human)
Description:
ChEMBL_586597
Residue:
833
  
Inhibitor
Name:
BDBM519595
Synonyms:
US11142525, Example 11
Type:
Small organic molecule
Emp. Form.:
C21H25N7O
Mol. Mass.:
391.4695
SMILES:
CC(C)c1[nH]ncc1-c1cccc(n1)N1Cc2c(cc(nc2CN)N(C)C)C1=O
: