Target
Large envelope protein
Ligand
BDBM519997
Substrate
Meas. Tech.
Test of Anti HBV Activity In Vitro
EC50
6.00±n/a nM
Citation
 Ren, QLiu, XHuang, JZhang, YGoldmann, S Dihydropyrimidine compounds and uses thereof in medicine US Patent  US11142527 Publication Date 10/12/2021 
Target
Name:
Large envelope protein
Synonyms:
HBSAG_HBVD3 | S
Type:
Mol. Mass.:
42772.52
Organism:
Hepatitis B virus
Description:
P03138
Residue:
389
  
Inhibitor
Name:
BDBM519997
Synonyms:
1-(4-((S)-7-(((R)-6-(2-chloro-4-fluorophenyl)-5-(methoxycarbonyl)-2-(thiazol-2-yl)-3,6-dihydroprimidin-4-yl)methyl)-3-oxohexahydroimidazo[1,5-a]pyrazin-2(3H)-yl)phenyl) cyclopentane carboxylic acid | US11142527, Example 29
Type:
Small organic molecule
Emp. Form.:
C34H34ClFN6O5S
Mol. Mass.:
693.187
SMILES:
COC(=O)C1=C(CN2CCN3[C@H](CN(C3=O)c3ccc(cc3)C3(CCCC3)C(O)=O)C2)NC(=N[C@H]1c1ccc(F)cc1Cl)c1nccs1
: