Target
Large envelope protein
Ligand
BDBM520000
Substrate
Meas. Tech.
Test of Anti HBV Activity In Vitro
EC50
6.00±n/a nM
Citation
 Ren, QLiu, XHuang, JZhang, YGoldmann, S Dihydropyrimidine compounds and uses thereof in medicine US Patent  US11142527 Publication Date 10/12/2021 
Target
Name:
Large envelope protein
Synonyms:
HBSAG_HBVD3 | S
Type:
Mol. Mass.:
42772.52
Organism:
Hepatitis B virus
Description:
P03138
Residue:
389
  
Inhibitor
Name:
BDBM520000
Synonyms:
1-(3-((S)-7-(((R)-6-(2-chloro-4-fluorophenyl)-5-(methoxycarbonyl)-2-(thiazol-2-yl)-3,6-dihydropyrimidin-4-yl)methyl)-3-oxohexahydroimidazo[1,5-a]pyrazin-2(3H)-yl)-5-fluorophenyl)piperidine-4-carboxylic acid | US11142527, Example 32
Type:
Small organic molecule
Emp. Form.:
C34H34ClF2N7O5S
Mol. Mass.:
726.192
SMILES:
COC(=O)C1=C(CN2CCN3[C@H](CN(C3=O)c3cc(F)cc(c3)N3CCC(CC3)C(O)=O)C2)NC(=N[C@H]1c1ccc(F)cc1Cl)c1nccs1
: