Target
Large envelope protein
Ligand
BDBM520007
Substrate
Meas. Tech.
Test of Anti HBV Activity In Vitro
EC50
6.60±n/a nM
Citation
 Ren, QLiu, XHuang, JZhang, YGoldmann, S Dihydropyrimidine compounds and uses thereof in medicine US Patent  US11142527 Publication Date 10/12/2021 
Target
Name:
Large envelope protein
Synonyms:
HBSAG_HBVD3 | S
Type:
Mol. Mass.:
42772.52
Organism:
Hepatitis B virus
Description:
P03138
Residue:
389
  
Inhibitor
Name:
BDBM520007
Synonyms:
US11142527, Example 39
Type:
Small organic molecule
Emp. Form.:
C32H29ClFN7O4S
Mol. Mass.:
662.134
SMILES:
COC(=O)C1=C(CN2CCN3[C@H](CN(CC#Cc4ccc(cc4)C(N)=O)C3=O)C2)NC(=N[C@H]1c1ccc(F)cc1Cl)c1nccs1
: