Target
Large envelope protein
Ligand
BDBM520029
Substrate
Meas. Tech.
Test of Anti HBV Activity In Vitro
EC50
5.40±n/a nM
Citation
 Ren, QLiu, XHuang, JZhang, YGoldmann, S Dihydropyrimidine compounds and uses thereof in medicine US Patent  US11142527 Publication Date 10/12/2021 
Target
Name:
Large envelope protein
Synonyms:
HBSAG_HBVD3 | S
Type:
Mol. Mass.:
42772.52
Organism:
Hepatitis B virus
Description:
P03138
Residue:
389
  
Inhibitor
Name:
BDBM520029
Synonyms:
US11142527, Example 76
Type:
Small organic molecule
Emp. Form.:
C34H35ClFN7O6S
Mol. Mass.:
724.201
SMILES:
COC(=O)C1=C(CN2CCN3[C@H](CN(C3=O)c3ccc(cc3)N3CCOC(CC(O)=O)C3)C2)NC(=N[C@H]1c1ccc(F)cc1Cl)c1nccs1
: