Target
Large envelope protein
Ligand
BDBM520045
Substrate
Meas. Tech.
Test of Anti HBV Activity In Vitro
EC50
6.20±n/a nM
Citation
 Ren, QLiu, XHuang, JZhang, YGoldmann, S Dihydropyrimidine compounds and uses thereof in medicine US Patent  US11142527 Publication Date 10/12/2021 
Target
Name:
Large envelope protein
Synonyms:
HBSAG_HBVD3 | S
Type:
Mol. Mass.:
42772.52
Organism:
Hepatitis B virus
Description:
P03138
Residue:
389
  
Inhibitor
Name:
BDBM520045
Synonyms:
(R)-methyl 4-(2-chloro-4-fluorophenyl)-6-(((S)-2-(4-(4-(methylsulfonyl)phenoxy) phenyl)-3-oxohexahydroimidazo[1,5-a]pyrazin-7(1H)-yl)methyl)-2-(thiazol-2-yl)-1,4-dihydropyrimidine-5-carboxylate | US11142527, Example 106
Type:
Small organic molecule
Emp. Form.:
C35H32ClFN6O6S2
Mol. Mass.:
751.247
SMILES:
COC(=O)C1=C(CN2CCN3[C@H](CN(C3=O)c3ccc(Oc4ccc(cc4)S(C)(=O)=O)cc3)C2)NC(=N[C@H]1c1ccc(F)cc1Cl)c1nccs1
: