Target
Receptor-interacting serine/threonine-protein kinase 2
Ligand
BDBM303887
Substrate
Meas. Tech.
Inhibition Assay
IC50
1.40±n/a nM
Citation
 Liu, PMiller, CAYu, MZhang, ZRuppel, SPadayana, AK Substituted benzamides as RIPK2 inhibitors US Patent  US11130754 Publication Date 9/28/2021 
Target
Name:
Receptor-interacting serine/threonine-protein kinase 2
Synonyms:
CARDIAK RIP2 RIPK2_HUMAN Tyrosine-protein kinase RIPK2 | receptor-interacting serine/threonine-protein kinase 2
Type:
Protein
Mol. Mass.:
61201.30
Organism:
Homo sapiens (Human)
Description:
Residue:
540
  
Inhibitor
Name:
BDBM303887
Synonyms:
US10138241, Example 75 | US11130754, Example 75
Type:
Small organic molecule
Emp. Form.:
C24H24FN5O2
Mol. Mass.:
433.4781
SMILES:
Cc1cc(F)c(cc1-c1cnn(c1)-c1cnc2ccc(cn12)C(C)(C)O)C(=O)NC1CC1
: