Target
Dihydroorotate dehydrogenase (quinone), mitochondrial
Ligand
BDBM520617
Substrate
Meas. Tech.
Measurement of DHODH Inhibitory Enzyme Activity (In Vitro Assays)
IC50
<100.0±n/a nM
Citation
 Nellore, KHosahalli, S Methods of use for trisubstituted benzotriazole derivatives as dihydroorotate oxygenase inhibitors US Patent  US11147801 Publication Date 10/19/2021 
Target
Name:
Dihydroorotate dehydrogenase (quinone), mitochondrial
Synonyms:
DHODH Dihydroorotate dehydrogenase Dihydroorotate dehydrogenase, mitochondrial Dihydroorotate oxidase (DHODH) | PYRD_HUMAN
Type:
Enzyme
Mol. Mass.:
42881.33
Organism:
Homo sapiens (Human)
Description:
Q02127
Residue:
395
  
Inhibitor
Name:
BDBM520617
Synonyms:
1-methyl-5-(2'-methyl-[1,1'-biphenyl]-4-yl)-1H-benzo[d][1,2,3]triazole-7- carboxylic acid; | US11147801, Compound 1
Type:
Small organic molecule
Emp. Form.:
C21H17N3O2
Mol. Mass.:
343.3786
SMILES:
Cc1ccccc1-c1ccc(cc1)-c1cc(C(O)=O)c2n(C)nnc2c1
: