Target
Dihydroorotate dehydrogenase (quinone), mitochondrial
Ligand
BDBM520620
Substrate
Meas. Tech.
Measurement of DHODH Inhibitory Enzyme Activity (In Vitro Assays)
IC50
<100.0±n/a nM
Citation
 Nellore, KHosahalli, S Methods of use for trisubstituted benzotriazole derivatives as dihydroorotate oxygenase inhibitors US Patent  US11147801 Publication Date 10/19/2021 
Target
Name:
Dihydroorotate dehydrogenase (quinone), mitochondrial
Synonyms:
DHODH Dihydroorotate dehydrogenase Dihydroorotate dehydrogenase, mitochondrial Dihydroorotate oxidase (DHODH) | PYRD_HUMAN
Type:
Enzyme
Mol. Mass.:
42881.33
Organism:
Homo sapiens (Human)
Description:
Q02127
Residue:
395
  
Inhibitor
Name:
BDBM520620
Synonyms:
5-(4-(2,5-dimethyl-1H-pyrrol-1-yl)phenyl)-1-methyl-1H-benzo[d][1,2,3]triazole- 7-carboxylic acid; | US11147801, Compound 12
Type:
Small organic molecule
Emp. Form.:
C20H18N4O2
Mol. Mass.:
346.3825
SMILES:
Cc1ccc(C)n1-c1ccc(cc1)-c1cc(C(O)=O)c2n(C)nnc2c1
: