Target
Dihydroorotate dehydrogenase (quinone), mitochondrial
Ligand
BDBM520629
Substrate
Meas. Tech.
Measurement of DHODH Inhibitory Enzyme Activity (In Vitro Assays)
IC50
550±n/a nM
Citation
 Nellore, KHosahalli, S Methods of use for trisubstituted benzotriazole derivatives as dihydroorotate oxygenase inhibitors US Patent  US11147801 Publication Date 10/19/2021 
Target
Name:
Dihydroorotate dehydrogenase (quinone), mitochondrial
Synonyms:
DHODH Dihydroorotate dehydrogenase Dihydroorotate dehydrogenase, mitochondrial Dihydroorotate oxidase (DHODH) | PYRD_HUMAN
Type:
Enzyme
Mol. Mass.:
42881.33
Organism:
Homo sapiens (Human)
Description:
Q02127
Residue:
395
  
Inhibitor
Name:
BDBM520629
Synonyms:
1-methyl-5-(2,3,5,6-tetrafluoro-3'-(morpholinomethyl)-[1,1'-biphenyl]-4-yl)-1H- benzo[d][1,2,3]triazole-7-carboxylic acid; | US11147801, Compound 33
Type:
Small organic molecule
Emp. Form.:
C25H20F4N4O3
Mol. Mass.:
500.4449
SMILES:
Cn1nnc2cc(cc(C(O)=O)c12)-c1c(F)c(F)c(c(F)c1F)-c1cccc(CN2CCOCC2)c1
: