Target
Dihydroorotate dehydrogenase (quinone), mitochondrial
Ligand
BDBM520643
Substrate
Meas. Tech.
Measurement of DHODH Inhibitory Enzyme Activity (In Vitro Assays)
IC50
>1000±n/a nM
Citation
 Nellore, KHosahalli, S Methods of use for trisubstituted benzotriazole derivatives as dihydroorotate oxygenase inhibitors US Patent  US11147801 Publication Date 10/19/2021 
Target
Name:
Dihydroorotate dehydrogenase (quinone), mitochondrial
Synonyms:
DHODH Dihydroorotate dehydrogenase Dihydroorotate dehydrogenase, mitochondrial Dihydroorotate oxidase (DHODH) | PYRD_HUMAN
Type:
Enzyme
Mol. Mass.:
42881.33
Organism:
Homo sapiens (Human)
Description:
Q02127
Residue:
395
  
Inhibitor
Name:
BDBM520643
Synonyms:
5-(3'-acetamido-[1,1'-biphenyl]-4-yl)-1-methyl-1H-benzo[d][1,2,3]triazole-7- carboxylic acid; | US11147801, Compound 32
Type:
Small organic molecule
Emp. Form.:
C22H18N4O3
Mol. Mass.:
386.4033
SMILES:
CC(=O)Nc1cccc(c1)-c1ccc(cc1)-c1cc(C(O)=O)c2n(C)nnc2c1
: