Target
Histamine H1 receptor
Ligand
BDBM179867
Substrate
Meas. Tech.
radioligand binding assay
Ki
8.40±n/a nM
Citation
 De Colle, CPasricha, P Methods for treating GI tract disorders US Patent  US11147820 Publication Date 10/19/2021 
Target
Name:
Histamine H1 receptor
Synonyms:
HISTAMINE H1 HRH1_CAVPO
Type:
G Protein-Coupled Receptor (GPCR)
Mol. Mass.:
55641.53
Organism:
Cavia porcellus (domestic guinea pig)
Description:
Guinea pig cerebellum was used in binding assay.
Residue:
488
  
Inhibitor
Name:
BDBM179867
Synonyms:
US11147820, Compound Metopimazine | US9132134, Metopimazine (NG101)
Type:
Small organic molecule
Emp. Form.:
C22H27N3O3S2
Mol. Mass.:
445.598
SMILES:
CS(=O)(=O)c1ccc2Sc3ccccc3N(CCCN3CCC(CC3)C(O)=N)c2c1
: