Target
Dimer of Gag-Pol polyprotein [501-599,Q508K,L534I,L564I,C568A,C596A,I551V]
Ligand
BDBM517
Substrate
HIV Peptide Substrate
Meas. Tech.
Protease Inhibition Assay
pH
5.6±n/a
Temperature
310.15±n/a K
Ki
10.4±1 nM
Km
57000±12000 nM
Comments
Kcat/Km=30±7 min-1nM-1
Citation
 Kovalevsky, AYTie, YLiu, FBoross, PIWang, YFLeshchenko, SGhosh, AKHarrison, RWWeber, IT Effectiveness of nonpeptide clinical inhibitor TMC-114 on HIV-1 protease with highly drug resistant mutations D30N, I50V, and L90M. J Med Chem 49:1379-87 (2006)  
Target
Name:
Dimer of Gag-Pol polyprotein [501-599,Q508K,L534I,L564I,C568A,C596A,I551V]
Synonyms:
HIV-1 Protease Mutant (I50V)
Type:
Protein Complex
Mol. Mass.:
Description:
Components:
This complex has 2 components.
Component 1
Name:
Gag-Pol polyprotein [501-599,Q508K,L534I,L564I,C568A,C596A,I551V]
Synonyms:
HIV-1 Protease Mutant (I50V) chain A POL_HV1BR | gag-pol
Type:
Enzyme Subunit
Mol. Mass.:
10718.08
Organism:
Human immunodeficiency virus type 1
Description:
All of the mutant constructs in this study are on the wild type containing the substitutions Q7K, L33I, and L63I, to minimize the autoproteolysis of the protease, and C67A and C95A, to prevent cysteine-thiol oxidation.
Residue:
99
  
Component 2
Name:
Gag-Pol polyprotein [501-599,Q508K,L534I,L564I,C568A,C596A,I551V]
Synonyms:
HIV-1 Protease Mutant (I50V) chain A POL_HV1BR | gag-pol
Type:
Enzyme Subunit
Mol. Mass.:
10718.08
Organism:
Human immunodeficiency virus type 1
Description:
All of the mutant constructs in this study are on the wild type containing the substitutions Q7K, L33I, and L63I, to minimize the autoproteolysis of the protease, and C67A and C95A, to prevent cysteine-thiol oxidation.
Residue:
99
  
Inhibitor
Name:
BDBM517
Synonyms:
(2S)-1-[(2S,4R)-4-benzyl-2-hydroxy-4-{[(1S,2R)-2-hydroxy-2,3-dihydro-1H-inden-1-yl]carbamoyl}butyl]-N-tert-butyl-4-(pyridin-3-ylmethyl)piperazine-2-carboxamide Crixivan Indinavir L-735, 524 | MK639
Type:
Small organic molecule
Emp. Form.:
C36H47N5O4
Mol. Mass.:
613.7895
SMILES:
CC(C)(C)NC(=O)[C@@H]1CN(Cc2cccnc2)CCN1C[C@@H](O)C[C@@H](Cc1ccccc1)C(=O)N[C@@H]1[C@H](O)Cc2ccccc12
:
Substrate
Name:
HIV Peptide Substrate
Synonyms:
Type:
Peptide
Mol. Mass.:
3156.95
Organism:
Description:
Residue:
27