Target
Serine protease 1
Ligand
BDBM521745
Substrate
Meas. Tech.
Chromogenic Enzyme Activity Assays
Ki
>50000±n/a nM
Citation
 Kaiser, MKöcher, SRey, JBongard, JEhrmann, MResch, S Tailored cyclodepsipeptides as potent non-covalent serine protease inhibitors US Patent  US11149067 Publication Date 10/19/2021 
Target
Name:
Serine protease 1
Synonyms:
Beta-Trypsin PRSS1 TRY1 TRYP1 Trypsin I
Type:
Enzyme
Mol. Mass.:
25790.52
Organism:
Bos taurus (bovine)
Description:
P00760
Residue:
246
  
Inhibitor
Name:
BDBM521745
Synonyms:
US11149067, Compound Ahp4
Type:
Small organic molecule
Emp. Form.:
C55H74N8O12
Mol. Mass.:
1039.2225
SMILES:
CC(C)C[C@@H]1N2[C@H](O)CC[C@H](NC(=O)[C@@H](NC(=O)[C@@H](NC(=O)[C@H](Cc3ccccc3)NC(=O)C(C)NC(=O)OCc3ccccc3)[C@@H](C)OC(=O)[C@@H](NC(=O)[C@H](Cc3ccccc3)N(C)C1=O)C(C)C)C(C)C)C2=O
: