Target
Tyrosine-protein kinase JAK1
Ligand
BDBM521922
Substrate
Meas. Tech.
Enzyme Assay
Ki
0.090±n/a nM
Citation
 Romero, FAZak, MZhao, GGibbons, PLi, WCheng, YYuen, PCheng, L Pyrazolopyrimidine compounds and methods of use thereof US Patent  US11155557 Publication Date 10/26/2021 
Target
Name:
Tyrosine-protein kinase JAK1
Synonyms:
JAK-1 JAK1A JAK1_HUMAN Janus kinase 1 (JAK1) | Janus kinase 1 JAK1
Type:
Protein
Mol. Mass.:
133293.73
Organism:
Homo sapiens (Human)
Description:
P23458
Residue:
1154
  
Inhibitor
Name:
BDBM521922
Synonyms:
N-[3-[6-(difluoromethoxy)- 3,4-dihydro-2H-1,4- benzothiazin-7-yl]-1H- pyrazol-4-yl]pyrazolo[1,5- a]pyrimidine-3-carboxamide | US11155557, Example 12
Type:
Small organic molecule
Emp. Form.:
C19H15F2N7O2S
Mol. Mass.:
443.43
SMILES:
FC(F)Oc1cc2NCCSc2cc1-c1n[nH]cc1NC(=O)c1cnn2cccnc12
: