Target
Tyrosine-protein kinase JAK1
Ligand
BDBM521926
Substrate
Meas. Tech.
Enzyme Assay
Ki
0.210±n/a nM
Citation
 Romero, FAZak, MZhao, GGibbons, PLi, WCheng, YYuen, PCheng, L Pyrazolopyrimidine compounds and methods of use thereof US Patent  US11155557 Publication Date 10/26/2021 
Target
Name:
Tyrosine-protein kinase JAK1
Synonyms:
JAK-1 JAK1A JAK1_HUMAN Janus kinase 1 (JAK1) | Janus kinase 1 JAK1
Type:
Protein
Mol. Mass.:
133293.73
Organism:
Homo sapiens (Human)
Description:
P23458
Residue:
1154
  
Inhibitor
Name:
BDBM521926
Synonyms:
N-[3-[5-(difluoromethoxy)- 2,3-dihydrobenzofuran-6-yl]- 1H-pyrazol-4-yl]pyrazolo[1,5- a]pyrimidine-3-carboxamide | US11155557, Example 16
Type:
Small organic molecule
Emp. Form.:
C19H14F2N6O3
Mol. Mass.:
412.3497
SMILES:
FC(F)Oc1cc2CCOc2cc1-c1n[nH]cc1NC(=O)c1cnn2cccnc12
: