Target
Tyrosine-protein kinase JAK2
Ligand
BDBM521936
Substrate
Meas. Tech.
Enzyme Assay
Ki
0.080±n/a nM
Citation
 Romero, FAZak, MZhao, GGibbons, PLi, WCheng, YYuen, PCheng, L Pyrazolopyrimidine compounds and methods of use thereof US Patent  US11155557 Publication Date 10/26/2021 
Target
Name:
Tyrosine-protein kinase JAK2
Synonyms:
JAK-2 JAK2_HUMAN Janus kinase 2 (JAK2) | Janus kinase 2 (a protein tyrosine kinase)
Type:
Protein
Mol. Mass.:
130684.68
Organism:
Homo sapiens (Human)
Description:
O60674
Residue:
1132
  
Inhibitor
Name:
BDBM521936
Synonyms:
N-[3-[6- (difluoromethoxy)indan-5-yl]- 1H-pyrazol-4-yl]pyrazolo[1,5- a]pyrimidine-3-carboxamide | US11155557, Example 26
Type:
Small organic molecule
Emp. Form.:
C20H16F2N6O2
Mol. Mass.:
410.3768
SMILES:
FC(F)Oc1cc2CCCc2cc1-c1n[nH]cc1NC(=O)c1cnn2cccnc12
: