Target
Tyrosine-protein kinase JAK1
Ligand
BDBM521940
Substrate
Meas. Tech.
Enzyme Assay
Ki
0.300±n/a nM
Citation
 Romero, FAZak, MZhao, GGibbons, PLi, WCheng, YYuen, PCheng, L Pyrazolopyrimidine compounds and methods of use thereof US Patent  US11155557 Publication Date 10/26/2021 
Target
Name:
Tyrosine-protein kinase JAK1
Synonyms:
JAK-1 JAK1A JAK1_HUMAN Janus kinase 1 (JAK1) | Janus kinase 1 JAK1
Type:
Protein
Mol. Mass.:
133293.73
Organism:
Homo sapiens (Human)
Description:
P23458
Residue:
1154
  
Inhibitor
Name:
BDBM521940
Synonyms:
N-[3-(6-methoxy-1H-indazol- 5-yl)-1H-pyrazol-4- yl]pyrazolo[1,5-a]pyrimidine- 3-carboxamide | US11155557, Example 30
Type:
Small organic molecule
Emp. Form.:
C18H14N8O2
Mol. Mass.:
374.3562
SMILES:
COc1cc2[nH]ncc2cc1-c1n[nH]cc1NC(=O)c1cnn2cccnc12
: