Target
Tyrosine-protein kinase JAK2
Ligand
BDBM522007
Substrate
Meas. Tech.
Enzyme Assay
Ki
0.070±n/a nM
Citation
 Romero, FAZak, MZhao, GGibbons, PLi, WCheng, YYuen, PCheng, L Pyrazolopyrimidine compounds and methods of use thereof US Patent  US11155557 Publication Date 10/26/2021 
Target
Name:
Tyrosine-protein kinase JAK2
Synonyms:
JAK-2 JAK2_HUMAN Janus kinase 2 (JAK2) | Janus kinase 2 (a protein tyrosine kinase)
Type:
Protein
Mol. Mass.:
130684.68
Organism:
Homo sapiens (Human)
Description:
O60674
Residue:
1132
  
Inhibitor
Name:
BDBM522007
Synonyms:
N-[3-[6-(difluoromethoxy)-2- methyl-3-oxo-4H-1,4- benzothiazin-7-yl]-1-methyl- pyrazol-4-yl]pyrazolo[1,5- a]pyrimidine-3-carboxamide US11155557, Example 98
Type:
Small organic molecule
Emp. Form.:
C21H17F2N7O3S
Mol. Mass.:
485.467
SMILES:
CC1Sc2cc(-c3nn(C)cc3NC(=O)c3cnn4cccnc34)c(OC(F)F)cc2NC1=O
: