Target
Prostaglandin F2-alpha receptor
Ligand
BDBM523437
Substrate
Meas. Tech.
In Vitro Test of Inhibition of Human FP Receptor Activity
IC50
3.60±n/a nM
Citation
 Beck, HKast, RMeininghaus, MDietz, LFuerstner, CStellfeld, TAnlauf, SVon Buehler, CBairlein, MAnlahr, JMuenster, UTerjung, CJoerissen, HHauff, PMueller, JDroebner, KNagel, J Substituted N-arylethyl-2-arylquinoline-4-carboxamides and use thereof US Patent  US11136296 Publication Date 10/5/2021 
Target
Name:
Prostaglandin F2-alpha receptor
Synonyms:
PF2R_HUMAN PGF2 alpha receptor PTGFR Prostanoid FP receptor
Type:
Enzyme
Mol. Mass.:
40072.29
Organism:
Homo sapiens (Human)
Description:
P43088
Residue:
359
  
Inhibitor
Name:
BDBM523437
Synonyms:
US11136296, Example 168
Type:
Small organic molecule
Emp. Form.:
C29H27BrN2O4
Mol. Mass.:
547.44
SMILES:
COc1ccccc1[C@H](CCC(O)=O)CNC(=O)c1c(C)c(nc2ccc(Br)cc12)-c1ccccc1
: