Target
Prostaglandin F2-alpha receptor
Ligand
BDBM523470
Substrate
Meas. Tech.
In Vitro Test of Inhibition of Human FP Receptor Activity
IC50
1.20±n/a nM
Citation
 Beck, HKast, RMeininghaus, MDietz, LFuerstner, CStellfeld, TAnlauf, SVon Buehler, CBairlein, MAnlahr, JMuenster, UTerjung, CJoerissen, HHauff, PMueller, JDroebner, KNagel, J Substituted N-arylethyl-2-arylquinoline-4-carboxamides and use thereof US Patent  US11136296 Publication Date 10/5/2021 
Target
Name:
Prostaglandin F2-alpha receptor
Synonyms:
PF2R_HUMAN PGF2 alpha receptor PTGFR Prostanoid FP receptor
Type:
Enzyme
Mol. Mass.:
40072.29
Organism:
Homo sapiens (Human)
Description:
P43088
Residue:
359
  
Inhibitor
Name:
BDBM523470
Synonyms:
US11136296, Example 201
Type:
Small organic molecule
Emp. Form.:
C28H22BrClF2N2O3
Mol. Mass.:
587.84
SMILES:
Cc1c(nc2ccc(Br)cc2c1C(=O)NC[C@H](CCC(O)=O)c1c(Cl)ccc(F)c1F)-c1ccccc1
: