Target
Prostaglandin F2-alpha receptor
Ligand
BDBM523489
Substrate
Meas. Tech.
In Vitro Test of Inhibition of Human FP Receptor Activity
IC50
8.00±n/a nM
Citation
 Beck, HKast, RMeininghaus, MDietz, LFuerstner, CStellfeld, TAnlauf, SVon Buehler, CBairlein, MAnlahr, JMuenster, UTerjung, CJoerissen, HHauff, PMueller, JDroebner, KNagel, J Substituted N-arylethyl-2-arylquinoline-4-carboxamides and use thereof US Patent  US11136296 Publication Date 10/5/2021 
Target
Name:
Prostaglandin F2-alpha receptor
Synonyms:
PF2R_HUMAN PGF2 alpha receptor PTGFR Prostanoid FP receptor
Type:
Enzyme
Mol. Mass.:
40072.29
Organism:
Homo sapiens (Human)
Description:
P43088
Residue:
359
  
Inhibitor
Name:
BDBM523489
Synonyms:
US11136296, Example 220
Type:
Small organic molecule
Emp. Form.:
C30H25ClN2O3
Mol. Mass.:
496.984
SMILES:
Cc1c(nc2ccc(cc2c1C(=O)NC[C@@H](CCC(O)=O)c1ccccc1Cl)C#C)-c1ccccc1
: