Target
Tyrosine-protein kinase Mer
Ligand
BDBM246852
Substrate
Meas. Tech.
TAM Kinase Assay
IC50
<500±n/a nM
Citation
 Li, YBurns, DMFeng, HGlenn, JHe, CMei, SPan, JWang, XYe, Y Pyrrolopyrimidine derivatives as TAM inhibitors US Patent  US11136326 Publication Date 10/5/2021 
Target
Name:
Tyrosine-protein kinase Mer
Synonyms:
MER MERTK Proto-oncogene c-Mer Receptor tyrosine kinase MerTK | Tyrosine-protein kinase Mer
Type:
PROTEIN
Mol. Mass.:
110234.77
Organism:
Homo sapiens (Human)
Description:
ChEMBL_1498723
Residue:
999
  
Inhibitor
Name:
BDBM246852
Synonyms:
((2R,5S)-5-{2-[(1R)- 1-hydroxyethyl]-1H- imidazo[4,5- d]thieno[3,2- b]pyridin-1- yl}tetrahydro-2H- pyran-2- yl)acetonitrile US10065963, Compound 1 US10370387, Example 20 US10519163, Example 1 US11084822, Example 1 US11161855, Example 20 US11324749, Comp. No. 5 US11596632, Comp. No. 5 US9732097, Example 1 US9908895, Example 20
Type:
Small organic molecule
Emp. Form.:
C17H18N4O2S
Mol. Mass.:
342.415
SMILES:
C[C@@H](O)c1nc2cnc3ccsc3c2n1[C@H]1CC[C@H](CC#N)OC1
: