Target
Mitogen-activated protein kinase kinase kinase 5
Ligand
BDBM524870
Substrate
Meas. Tech.
TR-FRET Assay
IC50
<100.0±n/a nM
Citation
 Gonzalez Lopez de Turiso, FHimmelbauer, MLuzzio, MJ ASK1 inhibiting agents US Patent  US11168095 Publication Date 11/9/2021 
Target
Name:
Mitogen-activated protein kinase kinase kinase 5
Synonyms:
ASK1 MAP3K5 MEKK5
Type:
Protein
Mol. Mass.:
154514.93
Organism:
Homo sapiens (Human)
Description:
Q99683
Residue:
1374
  
Inhibitor
Name:
BDBM524870
Synonyms:
US11168095, Example 10
Type:
Small organic molecule
Emp. Form.:
C22H22F2N6O2
Mol. Mass.:
440.4459
SMILES:
FC1(F)CCN(C1)c1ccc2OCCCCn3cnnc3-c3cccc(NC(=O)c2c1)n3
: