Target
Mitogen-activated protein kinase kinase kinase 5
Ligand
BDBM524894
Substrate
Meas. Tech.
TR-FRET Assay
IC50
<100.0±n/a nM
Citation
 Gonzalez Lopez de Turiso, FHimmelbauer, MLuzzio, MJ ASK1 inhibiting agents US Patent  US11168095 Publication Date 11/9/2021 
Target
Name:
Mitogen-activated protein kinase kinase kinase 5
Synonyms:
ASK1 MAP3K5 MEKK5
Type:
Protein
Mol. Mass.:
154514.93
Organism:
Homo sapiens (Human)
Description:
Q99683
Residue:
1374
  
Inhibitor
Name:
BDBM524894
Synonyms:
US11168095, Example 42
Type:
Small organic molecule
Emp. Form.:
C23H23N7O2
Mol. Mass.:
429.4744
SMILES:
Cc1ncn(c1C)-c1ccc2OCCCCn3cnnc3-c3cccc(NC(=O)c2c1)n3
: