Target
Mitogen-activated protein kinase kinase kinase 5
Ligand
BDBM524895
Substrate
Meas. Tech.
TR-FRET Assay
IC50
<100.0±n/a nM
Citation
 Gonzalez Lopez de Turiso, FHimmelbauer, MLuzzio, MJ ASK1 inhibiting agents US Patent  US11168095 Publication Date 11/9/2021 
Target
Name:
Mitogen-activated protein kinase kinase kinase 5
Synonyms:
ASK1 MAP3K5 MEKK5
Type:
Protein
Mol. Mass.:
154514.93
Organism:
Homo sapiens (Human)
Description:
Q99683
Residue:
1374
  
Inhibitor
Name:
BDBM524895
Synonyms:
US11168095, Example 44
Type:
Small organic molecule
Emp. Form.:
C21H19N7O2
Mol. Mass.:
401.4213
SMILES:
O=C1Nc2cccc(n2)-c2nncn2CCCCOc2ccc(cc12)-n1cccn1
: