Target
Mitogen-activated protein kinase kinase kinase 5
Ligand
BDBM524899
Substrate
Meas. Tech.
TR-FRET Assay
IC50
<100.0±n/a nM
Citation
 Gonzalez Lopez de Turiso, FHimmelbauer, MLuzzio, MJ ASK1 inhibiting agents US Patent  US11168095 Publication Date 11/9/2021 
Target
Name:
Mitogen-activated protein kinase kinase kinase 5
Synonyms:
ASK1 MAP3K5 MEKK5
Type:
Protein
Mol. Mass.:
154514.93
Organism:
Homo sapiens (Human)
Description:
Q99683
Residue:
1374
  
Inhibitor
Name:
BDBM524899
Synonyms:
(S)-10-Methyl-55-(4-methyl-1H-imidazol-1-yl)-14H-6-oxa-3-aza-2(2,6)-pyridina-1(3,4)-triazola-5(1,2)-benzenacyclodecaphan-4-one | US11168095, Example 94
Type:
Small organic molecule
Emp. Form.:
C23H23N7O2
Mol. Mass.:
429.4744
SMILES:
C[C@H]1CCCOc2ccc(cc2C(=O)Nc2cccc(n2)-c2nncn12)-n1cnc(C)c1
: